Reaction Details
TargetcGMP-specific 3',5'-cyclic phosphodiesterase
LigandBDBM14754
Substrate/Competitorn/a
Meas. Tech.ChEBML_217516
IC50 8800±n/a nM
Citation Takase, YSaeki, TFujimoto, MSaito, I Cyclic GMP phosphodiesterase inhibitors. 1. The discovery of a novel potent inhibitor, 4-((3,4-(methylenedioxy)benzyl)amino)-6,7,8-trimethoxyquinazoline. J Med Chem36:3765-70 (1994) cGMP-specific 3',5'-cyclic phosphodiesterase
Name:cGMP-specific 3',5'-cyclic phosphodiesterase
Type:Protein
Mol. Mass.:99975.83
Organism:Homo sapiens (Human)
Description:O76074
Residue:875
BDBM14754
NameBDBM14754
Synonyms:1-[(3,4-dimethoxyphenyl)methyl]-6,7-dimethoxy-isoquinoline 6,7-dimethoxy-1-veratryl-isoquinoline;hydrochloride Papaverine
TypeSmall organic molecule
Emp. Form.C20H21NO4
Mol. Mass.339.385
SMILESCOc1ccc(Cc2nccc3cc(OC)c(OC)cc23)cc1OC