Reaction Details
TargetPurine nucleoside phosphorylase
LigandBDBM50033666
Substrate/Competitorn/a
Meas. Tech.ChEMBL_162206 (CHEMBL767215)
Ki 8.7±n/a nM
Citation Erion, MDNiwas, SRose, JDAnanthan, SAllen, MSecrist, JABabu, YSBugg, CEGuida, WCEalick, SE Structure-based design of inhibitors of purine nucleoside phosphorylase. 3. 9-Arylmethyl derivatives of 9-deazaguanine substituted on the methylene group. J Med Chem36:3771-83 (1994) Purine nucleoside phosphorylase
Name:Purine nucleoside phosphorylase
Type:Enzyme
Mol. Mass.:32119.53
Organism:Homo sapiens (Human)
Description:n/a
Residue:289
BDBM50033666
NameBDBM50033666
Synonyms:2-[(2-amino-6-oxo-1,6-dihydro-9H-purin-9-yl)methoxy]ethyl trihydrogen diphosphate(ACVDP) CHEMBL7193 | {[2-(2-Amino-6-oxo-1,6-dihydro-purin-9-ylmethoxy)-ethoxy]-hydroxy-diphosphate
TypeSmall organic molecule
Emp. Form.C8H13N5O9P2
Mol. Mass.385.1644
SMILESNc1nc2n(COCCOP(O)(=O)OP(O)(O)=O)cnc2c(=O)[nH]1