Reaction Details
TargetPurine nucleoside phosphorylase
LigandBDBM50042807
Substrate/Competitorn/a
Meas. Tech.ChEBML_162036
IC50 25±n/a nM
Citation Erion, MDNiwas, SRose, JDAnanthan, SAllen, MSecrist, JABabu, YSBugg, CEGuida, WCEalick, SE Structure-based design of inhibitors of purine nucleoside phosphorylase. 3. 9-Arylmethyl derivatives of 9-deazaguanine substituted on the methylene group. J Med Chem36:3771-83 (1994) Purine nucleoside phosphorylase
Name:Purine nucleoside phosphorylase
Type:Enzyme
Mol. Mass.:32119.53
Organism:Homo sapiens (Human)
Description:n/a
Residue:289
BDBM50042807
NameBDBM50042807
Synonyms:2-Amino-7-[1-(3-chloro-phenyl)-3-hydroxy-propyl]-3,5-dihydro-pyrrolo[3,2-d]pyrimidin-4-one | CHEMBL331949
TypeSmall organic molecule
Emp. Form.C15H15ClN4O2
Mol. Mass.318.758
SMILESNc1nc2c(c[nH]c2c(=O)[nH]1)C(CCO)c1cccc(Cl)c1