Reaction Details
Target3-oxo-5-alpha-steroid 4-dehydrogenase 1
LigandBDBM50044878
Substrate/Competitorn/a
Meas. Tech.ChEMBL_213114 (CHEMBL873905)
IC50 11±n/a nM
Citation Jones, CDAudia, JELawhorn, DEMcQuaid, LANeubauer, BLPike, AJPennington, PAStamm, NBToomey, REHirsch, KS Nonsteroidal inhibitors of human type I steroid 5-alpha-reductase. J Med Chem36:421-3 (1993) 3-oxo-5-alpha-steroid 4-dehydrogenase 1
Name:3-oxo-5-alpha-steroid 4-dehydrogenase 1
Type:Enzyme
Mol. Mass.:29472.80
Organism:Homo sapiens (Human)
Description:P18405
Residue:259
BDBM50044878
NameBDBM50044878
Synonyms:4,8-Dimethyl-1,4,4a,5,6,10b-hexahydro-2H-benzo[f]quinolin-3-one | CHEMBL134357
TypeSmall organic molecule
Emp. Form.C15H19NO
Mol. Mass.229.3175
SMILESCN1[C@@H]2CCc3cc(C)ccc3[C@H]2CCC1=O