Reaction Details
TargetSigma non-opioid intracellular receptor 1
LigandBDBM50047724
Substrate/Competitorn/a
Meas. Tech.ChEMBL_226569 (CHEMBL848647)
Ki 2.5±n/a nM
Citation He, XSBowen, WDLee, KSWilliams, WWeinberger, DRde Costa, BR Synthesis and binding characteristics of potential SPECT imaging agents for sigma-1 and sigma-2 binding sites. J Med Chem36:566-71 (1993) Sigma non-opioid intracellular receptor 1
Name:Sigma non-opioid intracellular receptor 1
Type:Enzyme Catalytic Domain
Mol. Mass.:25124.85
Organism:Homo sapiens (Human)
Description:Q99720
Residue:223
BDBM50047724
NameBDBM50047724
Synonyms:CHEMBL152426 | [2-(4-Iodo-phenyl)-ethyl]-methyl-(2-pyrrolidin-1-yl-ethyl)-amine
TypeSmall organic molecule
Emp. Form.C15H23IN2
Mol. Mass.358.261
SMILESCN(CCN1CCCC1)CCc1ccc(I)cc1