Reaction Details
TargetPurine nucleoside phosphorylase
LigandBDBM50368824
Substrate/Competitorn/a
Meas. Tech.ChEMBL_153329 (CHEMBL760481)
Ki 37000±n/a nM
Citation Chern, JWLee, HYChen, CSShewach, DSDaddona, PETownsend, LB Nucleosides. 5. Synthesis of guanine and formycin B derivatives as potential inhibitors of purine nucleoside phosphorylase. J Med Chem36:1024-31 (1993) Purine nucleoside phosphorylase
Name:Purine nucleoside phosphorylase
Type:Enzyme
Mol. Mass.:32119.53
Organism:Homo sapiens (Human)
Description:n/a
Residue:289
BDBM50368824
NameBDBM50368824
Synonyms:CHEMBL606113
TypeSmall organic molecule
Emp. Form.C17H17FN6O8S
Mol. Mass.484.416
SMILESNc1nc2c(nc(N)[nH]c2=O)n1C1O[C@H](COC(=O)c2ccc(cc2)S(F)(=O)=O)[C@@H](O)[C@H]1O