Reaction Details
TargetPurine nucleoside phosphorylase
LigandBDBM50046869
Substrate/Competitorn/a
Meas. Tech.ChEMBL_153326 (CHEMBL760478)
Ki 12400±n/a nM
Citation Chern, JWLee, HYChen, CSShewach, DSDaddona, PETownsend, LB Nucleosides. 5. Synthesis of guanine and formycin B derivatives as potential inhibitors of purine nucleoside phosphorylase. J Med Chem36:1024-31 (1993) Purine nucleoside phosphorylase
Name:Purine nucleoside phosphorylase
Type:Enzyme
Mol. Mass.:32119.53
Organism:Homo sapiens (Human)
Description:n/a
Residue:289
BDBM50046869
NameBDBM50046869
Synonyms:2,8-Diamino-9-hexyl-1,9-dihydro-purin-6-one | CHEMBL8587
TypeSmall organic molecule
Emp. Form.C11H18N6O
Mol. Mass.250.3002
SMILESCCCCCCn1c(N)nc2c1nc(N)[nH]c2=O