Reaction Details
TargetPurine nucleoside phosphorylase
LigandBDBM50368826
Substrate/Competitorn/a
Meas. Tech.ChEMBL_153329 (CHEMBL760481)
Ki>300000±n/a nM
Citation Chern, JWLee, HYChen, CSShewach, DSDaddona, PETownsend, LB Nucleosides. 5. Synthesis of guanine and formycin B derivatives as potential inhibitors of purine nucleoside phosphorylase. J Med Chem36:1024-31 (1993) Purine nucleoside phosphorylase
Name:Purine nucleoside phosphorylase
Type:Enzyme
Mol. Mass.:32119.53
Organism:Homo sapiens (Human)
Description:n/a
Residue:289
BDBM50368826
NameBDBM50368826
Synonyms:CHEMBL603298
TypeSmall organic molecule
Emp. Form.C17H15FN4O8S
Mol. Mass.454.386
SMILESO[C@@H]1[C@@H](COC(=O)c2ccc(cc2)S(F)(=O)=O)OC([C@@H]1O)c1[nH]nc2c1nc[nH]c2=O