Reaction Details
TargetPlatelet-activating factor receptor
LigandBDBM81972
Substrate/Competitorn/a
Meas. Tech.ChEMBL_164922 (CHEMBL770633)
IC50 300±n/a nM
Citation Lamouri, AHeymans, FTavet, FDive, GBatt, JPBlavet, NBraquet, PGodfroid, JJ Design and modeling of new platelet-activating factor antagonists. 1. Synthesis and biological activity of 1,4-bis(3',4',5'-trimethoxybenzoyl)-2-[[(substituted carbonyl and carbamoyl)oxy]methyl]piperazines. J Med Chem36:990-1000 (1993) Platelet-activating factor receptor
Name:Platelet-activating factor receptor
Type:Protein
Mol. Mass.:39005.63
Organism:Cavia porcellus
Description:n/a
Residue:342
BDBM81972
NameBDBM81972
Synonyms:(S)-(+)-ALPHA-METHYL-1H-IMIDAZOLE-4-ETHANAMINE DIHYDROBROMIDE CAS_75614-93-6
TypeSmall organic molecule
Emp. Form.C6H11N3
Mol. Mass.125.1716
SMILESC[C@H](N)Cc1cnc[nH]1