Reaction Details
TargetCytochrome P450 2D6
LigandBDBM50030612
Substrate/Competitorn/a
Meas. Tech.ChEMBL_147855 (CHEMBL758057)
Ki 5.7±n/a nM
Citation Strobl, GRvon Kruedener, SStöckigt, JGuengerich, FPWolff, T Development of a pharmacophore for inhibition of human liver cytochrome P-450 2D6: molecular modeling and inhibition studies. J Med Chem36:1136-45 (1993) Cytochrome P450 2D6
Name:Cytochrome P450 2D6
Type:Protein
Mol. Mass.:55774.82
Organism:Homo sapiens (Human)
Description:P10635
Residue:497
BDBM50030612
NameBDBM50030612
Synonyms:(7aR,8S,11aS,12aS)-8-Methyl-5,6,7a,8,11a,12,12a,13-octahydro-7H-9-oxa-6a,13-diaza-indeno[2,1-a]anthracene-11-carboxylic acid methyl ester RAUWOLFIA SERPENTINA ROOT | ajmalicine
TypeSmall organic molecule
Emp. Form.C21H24N2O3
Mol. Mass.352.4269
SMILESCOC(=O)C1=CO[C@@H](C)[C@H]2CN3CCc4c([nH]c5ccccc45)[C@@H]3C[C@H]12