Reaction Details
TargetDelta-type opioid receptor
LigandBDBM50041665
Substrate/Competitorn/a
Meas. Tech.ChEMBL_145893 (CHEMBL754259)
IC50 33000±n/a nM
Citation Haaseth, RCHoran, PJBilsky, EJDavis, PZalewska, TSlaninova, JYamamura, HIWeber, SJDavis, TPPorreca, F [L-Ala3]DPDPE: a new enkephalin analog with a unique opioid receptor activity profile. Further evidence of delta-opioid receptor multiplicity. J Med Chem37:1572-7 (1994) Delta-type opioid receptor
Name:Delta-type opioid receptor
Type:Enzyme Catalytic Domain
Mol. Mass.:40577.25
Organism:MOUSE
Description:P32300
Residue:372
BDBM50041665
NameBDBM50041665
Synonyms:2-Amino-N-(7-benzyl-4-dihydroxymethyl-10-ethyl-3,3,14,14-tetramethyl-6,9,12-trioxo-1,2-dithia-5,8,11-triaza-cyclotetradec-13-yl)-3-(4-hydroxy-phenyl)-propionamide | CHEMBL2372423
TypeSmall organic molecule
Emp. Form.C31H43N5O7S2
Mol. Mass.661.832
SMILESC[C@H]1NC(=O)[C@@H](NC(=O)[C@@H](N)Cc2ccc(O)cc2)C(C)(C)SSC(C)(C)[C@H](NC(=O)[C@H](Cc2ccccc2)NC1=O)C(O)O