Reaction Details
TargetDihydrofolate reductase
LigandBDBM18050
Substrate/Competitorn/a
Meas. Tech.ChEMBL_54442 (CHEMBL669645)
IC50 6.6±n/a nM
Citation Kotake, YIijima, AYoshimatsu, KTamai, NOzawa, YKoyanagi, NKitoh, KNomura, H Synthesis and antitumor activities of novel 6-5 fused ring heterocycle antifolates: N-[4-[omega-(2-amino-4-substituted-6,7-dihydrocyclopenta [d]pyrimidin-5-yl)alkyl]benzoyl]-L-glutamic acids. J Med Chem37:1616-24 (1994) Dihydrofolate reductase
Name:Dihydrofolate reductase
Type:Enzyme
Mol. Mass.:21608.82
Organism:Mus musculus (Mouse)
Description:n/a
Residue:187
BDBM18050
NameBDBM18050
Synonyms:2-[(4-{[(2,4-diaminopteridin-6-yl)methyl](methyl)amino}phenyl)formamido]pentanedioic acid MTX cid_126941
TypeSmall organic molecule
Emp. Form.C20H22N8O5
Mol. Mass.454.4393
SMILESCN(Cc1cnc2nc(N)nc(N)c2n1)c1ccc(cc1)C(=O)N[C@@H](CCC(O)=O)C(O)=O