Reaction Details
TargetDihydrofolate reductase
LigandBDBM50041672
Substrate/Competitorn/a
Meas. Tech.ChEMBL_54442 (CHEMBL669645)
IC50 7.1±n/a nM
Citation Kotake, YIijima, AYoshimatsu, KTamai, NOzawa, YKoyanagi, NKitoh, KNomura, H Synthesis and antitumor activities of novel 6-5 fused ring heterocycle antifolates: N-[4-[omega-(2-amino-4-substituted-6,7-dihydrocyclopenta [d]pyrimidin-5-yl)alkyl]benzoyl]-L-glutamic acids. J Med Chem37:1616-24 (1994) Dihydrofolate reductase
Name:Dihydrofolate reductase
Type:Enzyme
Mol. Mass.:21608.82
Organism:Mus musculus (Mouse)
Description:n/a
Residue:187
BDBM50041672
NameBDBM50041672
Synonyms:2-{4-[3-(2,4-Diamino-6,7-dihydro-5H-cyclopentapyrimidin-5-yl)-propyl]-benzoylamino}-pentanedioic acid | CHEMBL41056
TypeSmall organic molecule
Emp. Form.C22H27N5O5
Mol. Mass.441.4803
SMILESNc1nc2CCC(CCCc3ccc(cc3)C(=O)NC(CCC(O)=O)C(O)=O)c2c(N)n1