Reaction Details
TargetThromboxane-A synthase
LigandBDBM50038591
Substrate/Competitorn/a
Meas. Tech.ChEMBL_209414 (CHEMBL816621)
IC50 2±n/a nM
Citation Ksander, GMErion, MYuan, AMDiefenbacher, CGel-Chehabi, LCote, DLevens, N Dual angiotensin converting enzyme/thromboxane synthase inhibitors. J Med Chem37:1823-32 (1994) Thromboxane-A synthase
Name:Thromboxane-A synthase
Type:Enzyme
Mol. Mass.:60524.67
Organism:Homo sapiens (Human)
Description:P24557
Residue:533
BDBM50038591
NameBDBM50038591
Synonyms:6-(5-Chloro-1-methyl-2-pyridin-3-yl-1H-indol-3-yl)-hexanoic acid | CHEMBL301550
TypeSmall organic molecule
Emp. Form.C20H21ClN2O2
Mol. Mass.356.846
SMILESCn1c(c(CCCCCC(O)=O)c2cc(Cl)ccc12)-c1cccnc1