Reaction Details
TargetNeprilysin
LigandBDBM50034866
Substrate/Competitorn/a
Meas. Tech.ChEMBL_144465 (CHEMBL755112)
IC50 18±n/a nM
Citation Gomez-Monterrey, IBeaumont, ANemecek, PRoques, BPFournie-Zaluski, MC New thiol inhibitors of neutral endopeptidase EC 3.4.24.11: synthesis and enzyme active-site recognition. J Med Chem37:1865-73 (1994) Neprilysin
Name:Neprilysin
Type:Enzyme
Mol. Mass.:85570.75
Organism:Oryctolagus cuniculus (rabbit)
Description:NEP was purified to homogeneity from rabbit kidney.
Residue:750
BDBM50034866
NameBDBM50034866
Synonyms:2-Benzyl-4-(2-carboxy-ethylcarbamoyl)-5-phenyl-pentanoic acid | CHEMBL47289
TypeSmall organic molecule
Emp. Form.C22H25NO5
Mol. Mass.383.4376
SMILESOC(=O)CCNC(=O)C(CC(Cc1ccccc1)C(O)=O)Cc1ccccc1