Reaction Details
TargetNeprilysin
LigandBDBM50024102
Substrate/Competitorn/a
Meas. Tech.ChEMBL_144472 (CHEMBL755537)
Ki 1.9±n/a nM
Citation Gomez-Monterrey, IBeaumont, ANemecek, PRoques, BPFournie-Zaluski, MC New thiol inhibitors of neutral endopeptidase EC 3.4.24.11: synthesis and enzyme active-site recognition. J Med Chem37:1865-73 (1994) Neprilysin
Name:Neprilysin
Type:Enzyme
Mol. Mass.:85570.75
Organism:Oryctolagus cuniculus (rabbit)
Description:NEP was purified to homogeneity from rabbit kidney.
Residue:750
BDBM50024102
NameBDBM50024102
Synonyms:((S)-2-Mercaptomethyl-3-phenyl-propionylamino)-acetic acid (S) (2-Mercaptomethyl-3-phenyl-propionylamino)-acetic acid CHEMBL298827
TypeSmall organic molecule
Emp. Form.C12H15NO3S
Mol. Mass.253.317
SMILESOC(=O)CNC(=O)[C@@H](CS)Cc1ccccc1