Reaction Details
TargetNeprilysin
LigandBDBM50084679
Substrate/Competitorn/a
Meas. Tech.ChEMBL_144472 (CHEMBL755537)
Ki 11±n/a nM
Citation Gomez-Monterrey, IBeaumont, ANemecek, PRoques, BPFournie-Zaluski, MC New thiol inhibitors of neutral endopeptidase EC 3.4.24.11: synthesis and enzyme active-site recognition. J Med Chem37:1865-73 (1994) Neprilysin
Name:Neprilysin
Type:Enzyme
Mol. Mass.:85570.75
Organism:Oryctolagus cuniculus (rabbit)
Description:NEP was purified to homogeneity from rabbit kidney.
Residue:750
BDBM50084679
NameBDBM50084679
Synonyms:2-[1-(2-Carboxy-2-hydroxy-ethylcarbamoyl)-2-phenyl-ethylamino]-4-phenyl-butyric acid(SCH39370) SCH-39370
TypeSmall organic molecule
Emp. Form.C22H26N2O6
Mol. Mass.414.4516
SMILESO[C@@H](CNC(=O)[C@H](Cc1ccccc1)NC(CCc1ccccc1)C(O)=O)C(O)=O