Reaction Details
TargetSigma non-opioid intracellular receptor 1
LigandBDBM94507
Substrate/Competitorn/a
Meas. Tech.ChEMBL_226573 (CHEMBL848650)
Ki 11±n/a nM
Citation Calderon, SNIzenwasser, SHeller, BGutkind, JSMattson, MVSu, TPNewman, AH Novel 1-phenylcycloalkanecarboxylic acid derivatives are potent and selective sigma 1 ligands. J Med Chem37:2285-91 (1994) Sigma non-opioid intracellular receptor 1
Name:Sigma non-opioid intracellular receptor 1
Type:Enzyme Catalytic Domain
Mol. Mass.:25266.54
Organism:RAT
Description:Q9R0C9
Residue:223
BDBM94507
NameBDBM94507
Synonyms:2-[2-(diethylamino)ethoxy]ethyl 1-phenylcyclopentane-1-carboxylate;2-hydroxypropane-1,2,3-tricarboxylic acid 2-hydroxypropane-1,2,3-tricarboxylic acid;1-phenyl-1-cyclopentanecarboxylic acid 2-[2-(diethylamino)ethoxy]ethyl ester CHEMBL73234 MLS002222257 cid_90010 | citric acid;1-phenylcyclopentanecarboxylic acid 2-[2-(diethylamino)ethoxy]ethyl ester
TypeSmall organic molecule
Emp. Form.C20H31NO3
Mol. Mass.333.465
SMILESCCN(CC)CCOCCOC(=O)C1(CCCC1)c1ccccc1