Reaction Details
TargetNeutrophil elastase
LigandBDBM50039637
Substrate/Competitorn/a
Meas. Tech.ChEMBL_63980 (CHEMBL677606)
Ki 0.01±n/a nM
Citation Subramanyam, CBell, MRCarabateas, PCourt, JJDority, JAFerguson, EGordon, RHlasta, DJKumar, VSaindane, M 2,6-Disubstituted aryl carboxylic acids, leaving groups"par excellence" for benzisothiazolone inhibitors of human leukocyte elastase. J Med Chem37:2623-6 (1994) Neutrophil elastase
Name:Neutrophil elastase
Type:Enzyme
Mol. Mass.:28532.38
Organism:Homo sapiens (Human)
Description:P08246
Residue:267
BDBM50039637
NameBDBM50039637
Synonyms:2,6-Dichloro-3-[(2-dimethylamino-ethyl)-methyl-sulfamoyl]-benzoic acid 4-isopropyl-1,1,3-trioxo-2,3-dihydro-1H-1lambda*6*-benzo[b]thiophen-2-ylmethyl ester; hydrochloride | CHEMBL538776
TypeSmall organic molecule
Emp. Form.C24H28Cl2N2O7S2
Mol. Mass.591.524
SMILESCC(C)c1cccc2c1C(=O)C(COC(=O)c1c(Cl)ccc(c1Cl)S(=O)(=O)N(C)CCN(C)C)S2(=O)=O