Reaction Details
TargetMuscarinic acetylcholine receptor M1
LigandBDBM50039845
Substrate/Competitorn/a
Meas. Tech.ChEMBL_138335 (CHEMBL747765)
IC50 320000±n/a nM
Citation Dunbar, PGDurant, GJRho, TOjo, BHuzl, JJSmith, DAel-Assadi, AASbeih, SNgur, DOPeriyasamy, S Design, synthesis, and neurochemical evaluation of 2-amino-5-(alkoxycarbonyl)-3,4,5,6-tetrahydropyridines and 2-amino-5-(alkoxycarbonyl)-1,4,5,6-tetrahydropyrimidines as M1 muscarinic receptor agonists. J Med Chem37:2774-82 (1994) Muscarinic acetylcholine receptor M1
Name:Muscarinic acetylcholine receptor M1
Type:Enzyme Catalytic Domain
Mol. Mass.:51390.46
Organism:RAT
Description:P08482
Residue:460
BDBM50039845
NameBDBM50039845
Synonyms:2-Amino-3,4,5,6-tetrahydro-pyridine-3-carboxylic acid methyl ester; hydrochloride | CHEMBL552914
TypeSmall organic molecule
Emp. Form.C7H12N2O2
Mol. Mass.156.1824
SMILESCOC(=O)C1CCCN=C1N