Reaction Details
TargetSodium channel protein type 2 subunit alpha
LigandBDBM50017702
Substrate/Competitorn/a
Meas. Tech.ChEMBL_144081 (CHEMBL753044)
IC50 420±n/a nM
Citation Roufos, IHays, SJDooley, DJSchwarz, RDCampbell, GWProbert, AW Synthesis and pharmacological evaluation of phenylacetamides as sodium-channel blockers. J Med Chem37:268-74 (1994) Sodium channel protein type 2 subunit alpha
Name:Sodium channel protein type 2 subunit alpha
Type:PROTEIN
Mol. Mass.:227854.11
Organism:Rattus norvegicus
Description:ChEMBL_1516893
Residue:2005
BDBM50017702
NameBDBM50017702
Synonyms:1-(bis(4-fluorophenyl)methyl)-4-cinnamylpiperazine 1-[Bis-(4-fluoro-phenyl)-methyl]-4-(3-phenyl-allyl)-piperazine CHEMBL30008 Flunarizine cid_6365505
TypeSmall organic molecule
Emp. Form.C26H26F2N2
Mol. Mass.404.4948
SMILESFc1ccc(cc1)C(N1CCN(C\C=C\c2ccccc2)CC1)c1ccc(F)cc1