Reaction Details
TargetThymidylate synthase
LigandBDBM50037317
Substrate/Competitorn/a
Meas. Tech.ChEMBL_209959 (CHEMBL820615)
IC50 64±n/a nM
Citation Bisset, GMBavetsias, VThornton, TJPawelczak, KCalvert, AHHughes, LRJackman, AL The synthesis and thymidylate synthase inhibitory activity of L-gamma-L-linked dipeptide and L-gamma-amide analogues of 2-desamino-2-methyl-N10-propargyl-5,8-dideazafolic acid (ICI 198583). J Med Chem37:3294-302 (1994) Thymidylate synthase
Name:Thymidylate synthase
Type:PROTEIN
Mol. Mass.:34957.15
Organism:Mus musculus
Description:ChEMBL_1340097
Residue:307
BDBM50037317
NameBDBM50037317
Synonyms:(R)-4-Methylcarbamoyl-2-{4-[(2-methyl-4-oxo-3,4-dihydro-quinazolin-6-ylmethyl)-prop-2-ynyl-amino]-benzoylamino}-butyric acid | CHEMBL324528
TypeSmall organic molecule
Emp. Form.C26H27N5O5
Mol. Mass.489.5231
SMILESCNC(=O)CC[C@@H](NC(=O)c1ccc(cc1)N(CC#C)Cc1ccc2nc(C)[nH]c(=O)c2c1)C(O)=O