Reaction Details
TargetThymidylate synthase
LigandBDBM50368894
Substrate/Competitorn/a
Meas. Tech.ChEMBL_209959 (CHEMBL820615)
IC50 24±n/a nM
Citation Bisset, GMBavetsias, VThornton, TJPawelczak, KCalvert, AHHughes, LRJackman, AL The synthesis and thymidylate synthase inhibitory activity of L-gamma-L-linked dipeptide and L-gamma-amide analogues of 2-desamino-2-methyl-N10-propargyl-5,8-dideazafolic acid (ICI 198583). J Med Chem37:3294-302 (1994) Thymidylate synthase
Name:Thymidylate synthase
Type:PROTEIN
Mol. Mass.:34957.15
Organism:Mus musculus
Description:ChEMBL_1340097
Residue:307
BDBM50368894
NameBDBM50368894
Synonyms:CHEMBL1790836
TypeSmall organic molecule
Emp. Form.C31H35N5O7
Mol. Mass.589.6389
SMILESCC[C@@H](C)[C@@H](NC(=O)CC[C@@H](NC(=O)c1ccc(cc1)N(CC#C)Cc1ccc2nc(C)[nH]c(=O)c2c1)C(O)=O)C(O)=O