Reaction Details
TargetMu-type opioid receptor
LigandBDBM50381677
Substrate/Competitorn/a
Meas. Tech.ChEMBL_146314 (CHEMBL758861)
Ki 1.2±n/a nM
Citation May, ELAceto, MDBowman, ERBentley, CMartin, BRHarris, LSMedzihradsky, FMattson, MVJacobson, AE Antipodal alpha-N-(methyl through decyl)-N-normetazocines (5,9 alpha-dimethyl-2'-hydroxy-6,7-benzomorphans): in vitro and in vivo properties. J Med Chem37:3408-18 (1994) Mu-type opioid receptor
Name:Mu-type opioid receptor
Type:Enzyme Catalytic Domain
Mol. Mass.:44431.62
Organism:MOUSE
Description:OPIATE Mu OPRM1 MOUSE::P42866
Residue:398
BDBM50381677
NameBDBM50381677
Synonyms:CHEMBL1256748 | U-69593
TypeSmall organic molecule
Emp. Form.C22H32N2O2
Mol. Mass.356.5017
SMILESCN([C@H]1C[C@@]2(CCCO2)CC[C@@H]1N1CCCC1)C(=O)Cc1ccccc1