Reaction Details
TargetMu-type opioid receptor
LigandBDBM50037488
Substrate/Competitorn/a
Meas. Tech.ChEMBL_136061 (CHEMBL746681)
Ki 756±n/a nM
Citation May, ELAceto, MDBowman, ERBentley, CMartin, BRHarris, LSMedzihradsky, FMattson, MVJacobson, AE Antipodal alpha-N-(methyl through decyl)-N-normetazocines (5,9 alpha-dimethyl-2'-hydroxy-6,7-benzomorphans): in vitro and in vivo properties. J Med Chem37:3408-18 (1994) Mu-type opioid receptor
Name:Mu-type opioid receptor
Type:G Protein-Coupled Receptor (GPCR)
Mol. Mass.:44789.51
Organism:Homo sapiens (Human)
Description:P35372
Residue:400
BDBM50037488
NameBDBM50037488
Synonyms:(6S,11S)-3-Decyl-6,11-dimethyl-1,2,3,4,5,6-hexahydro-2,6-methano-benzo[d]azocin-8-ol | CHEMBL324505
TypeSmall organic molecule
Emp. Form.C24H39NO
Mol. Mass.357.5726
SMILESCCCCCCCCCCN1CC[C@@]2(C)[C@H](C)C1Cc1ccc(O)cc21