Reaction Details
TargetSigma non-opioid intracellular receptor 1
LigandBDBM50368882
Substrate/Competitorn/a
Meas. Tech.ChEMBL_201905 (CHEMBL808196)
Ki 4300±n/a nM
Citation May, ELAceto, MDBowman, ERBentley, CMartin, BRHarris, LSMedzihradsky, FMattson, MVJacobson, AE Antipodal alpha-N-(methyl through decyl)-N-normetazocines (5,9 alpha-dimethyl-2'-hydroxy-6,7-benzomorphans): in vitro and in vivo properties. J Med Chem37:3408-18 (1994) Sigma non-opioid intracellular receptor 1
Name:Sigma non-opioid intracellular receptor 1
Type:Enzyme Catalytic Domain
Mol. Mass.:25124.85
Organism:Homo sapiens (Human)
Description:Q99720
Residue:223
BDBM50368882
NameBDBM50368882
Synonyms:CHEMBL147585 SK-10047
TypeSmall organic molecule
Emp. Form.C16H21NO
Mol. Mass.243.344
SMILESCC1C2Cc3ccc(O)cc3C1CCN2CC=C