Reaction Details
TargetKappa-type opioid receptor
LigandBDBM50037480
Substrate/Competitorn/a
Meas. Tech.ChEMBL_145383 (CHEMBL750073)
Ki 738±n/a nM
Citation May, ELAceto, MDBowman, ERBentley, CMartin, BRHarris, LSMedzihradsky, FMattson, MVJacobson, AE Antipodal alpha-N-(methyl through decyl)-N-normetazocines (5,9 alpha-dimethyl-2'-hydroxy-6,7-benzomorphans): in vitro and in vivo properties. J Med Chem37:3408-18 (1994) Kappa-type opioid receptor
Name:Kappa-type opioid receptor
Type:G Protein-Coupled Receptor (GPCR)
Mol. Mass.:42648.76
Organism:Homo sapiens (Human)
Description:P41145
Residue:380
BDBM50037480
NameBDBM50037480
Synonyms:(6R,11S)-6,11-Dimethyl-3-pentyl-1,2,3,4,5,6-hexahydro-2,6-methano-benzo[d]azocin-8-ol | CHEMBL324392
TypeSmall organic molecule
Emp. Form.C19H29NO
Mol. Mass.287.4397
SMILESCCCCCN1CC[C@]2(C)[C@H](C)C1Cc1ccc(O)cc21