Reaction Details
TargetReverse transcriptase/RNaseH
LigandBDBM50370476
Substrate/Competitorn/a
Meas. Tech.ChEMBL_195669 (CHEMBL800742)
IC50 3.0±n/a nM
Citation Okruszek, AOlesiak, MBalzarini, J The synthesis of nucleoside 5'-O-(1,1-dithiotriphosphates). J Med Chem37:3850-4 (1994) Reverse transcriptase/RNaseH
Name:Reverse transcriptase/RNaseH
Type:PROTEIN
Mol. Mass.:65229.15
Organism:Human immunodeficiency virus 1
Description:ChEMBL_1473730
Residue:566
BDBM50370476
NameBDBM50370476
Synonyms:Combivir | ZIDOVUDINE TRIPHOSPHATE
TypeSmall organic molecule
Emp. Form.C10H16N5O13P3
Mol. Mass.507.181
SMILESCc1cn([C@H]2C[C@H](N=[N+]=[N-])[C@@H](CO[P@@](O)(=O)O[P@@](O)(=O)OP(O)(O)=O)O2)c(=O)[nH]c1=O