Reaction Details
TargetNitric oxide synthase, inducible
LigandBDBM50063300
Substrate/Competitorn/a
Meas. Tech.ChEMBL_89371 (CHEMBL699604)
IC50 92000±n/a nM
Citation Moore, WMWebber, RKJerome, GMTjoeng, FSMisko, TPCurrie, MG L-N6-(1-iminoethyl)lysine: a selective inhibitor of inducible nitric oxide synthase. J Med Chem37:3886-8 (1994) Nitric oxide synthase, inducible
Name:Nitric oxide synthase, inducible
Type:PROTEIN
Mol. Mass.:130642.55
Organism:Rattus norvegicus
Description:ChEMBL_976228
Residue:1147
BDBM50063300
NameBDBM50063300
Synonyms:(L-N6-1-iminoethyl)lysine 6-Acetimidoylamino-2-amino-hexanoic acid CHEMBL7889 N~6~-[(1Z)-ethanimidoyl]-L-lysine | l-NIL
TypeSmall organic molecule
Emp. Form.C8H17N3O2
Mol. Mass.187.2395
SMILESCC(N)=NCCCC[C@H](N)C(O)=O