Reaction Details
TargetNeutrophil elastase
LigandBDBM50035486
Substrate/Competitorn/a
Meas. Tech.ChEMBL_63990 (CHEMBL673100)
Ki 44±n/a nM
Citation Angelastro, MRBaugh, LEBey, PBurkhart, JPChen, TMDurham, SLHare, CMHuber, EWJanusz, MJKoehl, JR Inhibition of human neutrophil elastase with peptidyl electrophilic ketones. 2. Orally active PG-Val-Pro-Val pentafluoroethyl ketones. J Med Chem37:4538-53 (1995) Neutrophil elastase
Name:Neutrophil elastase
Type:Enzyme
Mol. Mass.:28532.38
Organism:Homo sapiens (Human)
Description:P08246
Residue:267
BDBM50035486
NameBDBM50035486
Synonyms:(S)-1-{(S)-3-Methyl-2-[3-methyl-2-(morpholine-4-carbonyl)-butyrylamino]-butyryl}-pyrrolidine-2-carboxylic acid (3,3,4,4,4-pentafluoro-1-isopropyl-2-oxo-butyl)-amide | CHEMBL342379
TypeSmall organic molecule
Emp. Form.C27H41F5N4O6
Mol. Mass.612.6297
SMILESCC(C)[C@H](NC(=O)C(C(C)C)C(=O)N1CCOCC1)C(=O)N1CCC[C@H]1C(=O)NC(C(C)C)C(=O)C(F)(F)C(F)(F)F