Reaction Details
TargetNeutrophil elastase
LigandBDBM50035499
Substrate/Competitorn/a
Meas. Tech.ChEMBL_63994 (CHEMBL872887)
Ki 60±n/a nM
Citation Angelastro, MRBaugh, LEBey, PBurkhart, JPChen, TMDurham, SLHare, CMHuber, EWJanusz, MJKoehl, JR Inhibition of human neutrophil elastase with peptidyl electrophilic ketones. 2. Orally active PG-Val-Pro-Val pentafluoroethyl ketones. J Med Chem37:4538-53 (1995) Neutrophil elastase
Name:Neutrophil elastase
Type:Enzyme
Mol. Mass.:28532.38
Organism:Homo sapiens (Human)
Description:P08246
Residue:267
BDBM50035499
NameBDBM50035499
Synonyms:(S)-1-[(S)-3-Methyl-2-(2-morpholin-4-yl-acetylamino)-butyryl]-pyrrolidine-2-carboxylic acid (3,3,4,4,4-pentafluoro-1-isopropyl-2-oxo-butyl)-amide; hydrochloride | CHEMBL2372341
TypeSmall organic molecule
Emp. Form.C23H36ClF5N4O5
Mol. Mass.579.001
SMILESCl.CC(C)[C@H](NC(=O)CN1CCOCC1)C(=O)N1CCC[C@H]1C(=O)N[C@@H](C(C)C)C(=O)C(F)(F)C(F)(F)F