Reaction Details
TargetNeutrophil elastase
LigandBDBM50035505
Substrate/Competitorn/a
Meas. Tech.ChEMBL_63990 (CHEMBL673100)
Ki 39±n/a nM
Citation Angelastro, MRBaugh, LEBey, PBurkhart, JPChen, TMDurham, SLHare, CMHuber, EWJanusz, MJKoehl, JR Inhibition of human neutrophil elastase with peptidyl electrophilic ketones. 2. Orally active PG-Val-Pro-Val pentafluoroethyl ketones. J Med Chem37:4538-53 (1995) Neutrophil elastase
Name:Neutrophil elastase
Type:Enzyme
Mol. Mass.:28532.38
Organism:Homo sapiens (Human)
Description:P08246
Residue:267
BDBM50035505
NameBDBM50035505
Synonyms:CHEMBL140763 | N-{(S)-2-Methyl-1-[(S)-2-(3,3,4,4,4-pentafluoro-1-isopropyl-2-oxo-butylcarbamoyl)-pyrrolidine-1-carbonyl]-propyl}-terephthalamic acid
TypeSmall organic molecule
Emp. Form.C25H30F5N3O6
Mol. Mass.563.5142
SMILESCC(C)[C@H](NC(=O)c1ccc(cc1)C(O)=O)C(=O)N1CCC[C@H]1C(=O)NC(C(C)C)C(=O)C(F)(F)C(F)(F)F