Reaction Details
TargetNeuraminidase
LigandBDBM50040516
Substrate/Competitorn/a
Meas. Tech.ChEMBL_200797 (CHEMBL808321)
Ki 1±n/a nM
Citation Taylor, NRvon Itzstein, M Molecular modeling studies on ligand binding to sialidase from influenza virus and the mechanism of catalysis. J Med Chem37:616-24 (1994) Neuraminidase
Name:Neuraminidase
Type:Enzyme
Mol. Mass.:50124.14
Organism:Influenza A virus (A/Puerto Rico/8/34/Mount Sinai(H1N1))
Description:P03468
Residue:454
BDBM50040516
NameBDBM50040516
Synonyms:3-(acetylamino)-4-{[amino(iminio)methyl]amino}-2-[(1R,2R)-1,2,3-trihydroxypropyl]-3,4-dihydro-2H-pyran-6-carboxylate | CHEMBL157939
TypeSmall organic molecule
Emp. Form.C12H20N4O7
Mol. Mass.332.3098
SMILES[#6]-[#6](=O)-[#7]-[#6]-1-[#6](-[#8]-[#6](=[#6]-[#6]-1\[#7+]=[#6](\[#7])-[#7])-[#6](-[#8-])=O)-[#6](-[#8])-[#6](-[#8])-[#6]-[#8]