Reaction Details
TargetCarbonic anhydrase 2
LigandBDBM50041029
Substrate/Competitorn/a
Meas. Tech.ChEMBL_45060 (CHEMBL872425)
Ki 0.610000±n/a nM
Citation Greer, JErickson, JWBaldwin, JJVarney, MD Application of the three-dimensional structures of protein target molecules in structure-based drug design. J Med Chem37:1035-54 (1994) Carbonic anhydrase 2
Name:Carbonic anhydrase 2
Type:Enzyme
Mol. Mass.:29250.71
Organism:Homo sapiens (Human)
Description:P00918
Residue:260
BDBM50041029
NameBDBM50041029
Synonyms:(S)-4-Isobutylamino-7,7-dioxo-4,5,6,7-tetrahydro-7lambda*6*-thieno[2,3-b]thiopyran-2-sulfonic acid amide 4-Isopropylamino-7,7-dioxo-4,5,6,7-tetrahydro-7lambda*6*-thieno[2,3-b]thiopyran-2-sulfonic acid amide CHEMBL417975 MK-927
TypeSmall organic molecule
Emp. Form.C11H18N2O4S3
Mol. Mass.338.467
SMILESCC(C)CN[C@H]1CCS(=O)(=O)c2sc(cc12)S(N)(=O)=O