Reaction Details
TargetVoltage-dependent L-type calcium channel subunit alpha-1C
LigandBDBM50035796
Substrate/Competitorn/a
Meas. Tech.ChEMBL_53172 (CHEMBL666481)
Kd 36900±n/a nM
Citation Rovnyak, GCKimball, SDBeyer, BCucinotta, GDiMarco, JDGougoutas, JHedberg, AMalley, MMcCarthy, JPZhang, R Calcium entry blockers and activators: conformational and structural determinants of dihydropyrimidine calcium channel modulators. J Med Chem38:119-29 (1995) Voltage-dependent L-type calcium channel subunit alpha-1C
Name:Voltage-dependent L-type calcium channel subunit alpha-1C
Type:Enzyme Catalytic Domain
Mol. Mass.:248979.79
Organism:Homo sapiens (Human)
Description:Calcium channel (Type L) 0 HUMAN::Q13936
Residue:2221
BDBM50035796
NameBDBM50035796
Synonyms:2-Methylsulfanyl-4-(3-nitro-phenyl)-4,7-dihydro-1H-furo[3,4-d]pyrimidin-5-one | CHEMBL23720
TypeSmall organic molecule
Emp. Form.C13H11N3O4S
Mol. Mass.305.309
SMILESCSC1=NC(C2=C(COC2=[OH+])[N-]1)c1cccc(c1)[N+]([O-])=O