Reaction Details
TargetVoltage-dependent L-type calcium channel subunit alpha-1C
LigandBDBM50035790
Substrate/Competitorn/a
Meas. Tech.ChEMBL_53172 (CHEMBL666481)
Kd 30±n/a nM
Citation Rovnyak, GCKimball, SDBeyer, BCucinotta, GDiMarco, JDGougoutas, JHedberg, AMalley, MMcCarthy, JPZhang, R Calcium entry blockers and activators: conformational and structural determinants of dihydropyrimidine calcium channel modulators. J Med Chem38:119-29 (1995) Voltage-dependent L-type calcium channel subunit alpha-1C
Name:Voltage-dependent L-type calcium channel subunit alpha-1C
Type:Enzyme Catalytic Domain
Mol. Mass.:248979.79
Organism:Homo sapiens (Human)
Description:Calcium channel (Type L) 0 HUMAN::Q13936
Residue:2221
BDBM50035790
NameBDBM50035790
Synonyms:6-Methyl-2-methylsulfanyl-4-(2-methylsulfanyl-3-nitro-phenyl)-1,4-dihydro-pyrimidine-5-carboxylic acid methyl ester | CHEMBL280926
TypeSmall organic molecule
Emp. Form.C15H17N3O4S2
Mol. Mass.367.443
SMILESCOC(=O)C1=C(C)[N-]C(SC)=[NH+]C1c1cccc(c1SC)[N+]([O-])=O