Reaction Details
Target5-hydroxytryptamine receptor 1A
LigandBDBM50031474
Substrate/Competitorn/a
Meas. Tech.ChEMBL_1071 (CHEMBL616396)
Ki 63±n/a nM
Citation Buchheit, KHGamse, RGiger, RHoyer, DKlein, FKlöppner, EPfannkuche, HJMattes, H The serotonin 5-HT4 receptor. 1. Design of a new class of agonists and receptor map of the agonist recognition site. J Med Chem38:2326-30 (1995) 5-hydroxytryptamine receptor 1A
Name:5-hydroxytryptamine receptor 1A
Type:n/a
Mol. Mass.:46122.49
Organism:Homo sapiens (Human)
Description:n/a
Residue:422
BDBM50031474
NameBDBM50031474
Synonyms:(2E)-2-[(5-hydroxy-1H-indol-3-yl)methylene]hydrazinecarboximidamide | CHEMBL307364
TypeSmall organic molecule
Emp. Form.C10H11N5O
Mol. Mass.217.2272
SMILESNC(=N)NN=Cc1c[nH]c2ccc(O)cc12