Reaction Details
Target3-oxo-5-alpha-steroid 4-dehydrogenase 1
LigandBDBM50031896
Substrate/Competitorn/a
Meas. Tech.ChEMBL_204883 (CHEMBL808554)
Ki 4±n/a nM
Citation Frye, SVHaffner, CDMaloney, PRHiner, RNDorsey, GFNoe, RAUnwalla, RJBatchelor, KWBramson, HNStuart, JD Structure-activity relationships for inhibition of type 1 and 2 human 5 alpha-reductase and human adrenal 3 beta-hydroxy-delta 5-steroid dehydrogenase/3-keto-delta 5-steroid isomerase by 6-azaandrost-4-en-3-ones: optimization of the C17 substituent. J Med Chem38:2621-7 (1995) 3-oxo-5-alpha-steroid 4-dehydrogenase 1
Name:3-oxo-5-alpha-steroid 4-dehydrogenase 1
Type:Enzyme
Mol. Mass.:29472.80
Organism:Homo sapiens (Human)
Description:P18405
Residue:259
BDBM50031896
NameBDBM50031896
Synonyms:(1S,9aR,11aS)-9a,11a-Dimethyl-7-oxo-2,3,3a,3b,4,5,7,8,9,9a,9b,10,11,11a-tetradecahydro-1H-cyclopenta[i]phenanthridine-1-carboxylic acid (2,5-bis-trifluoromethyl-phenyl)-amide | CHEMBL327702
TypeSmall organic molecule
Emp. Form.C27H30F6N2O2
Mol. Mass.528.5297
SMILESC[C@]12CCC3C(CN=C4CC(=O)CC[C@]34C)C1CC[C@@H]2C(=O)Nc1cc(ccc1C(F)(F)F)C(F)(F)F