Reaction Details
Target5-hydroxytryptamine receptor 3A/3B
LigandBDBM50031932
Substrate/Competitorn/a
Meas. Tech.ChEMBL_3012 (CHEMBL620632)
Ki 1.6±n/a nM
Citation Anzini, MCappelli, AVomero, SGiorgi, GLanger, THamon, MMerahi, NEmerit, BMCagnotto, ASkorupska, M Novel, potent, and selective 5-HT3 receptor antagonists based on the arylpiperazine skeleton: synthesis, structure, biological activity, and comparative molecular field analysis studies. J Med Chem38:2692-704 (1995) 5-hydroxytryptamine receptor 3A/3B
Name:5-hydroxytryptamine receptor 3A/3B
Type:n/a
Mol. Mass.:n/a
Description:ASSAY_ID of EBI is 2974
Components:This complex has 2 components.
Component 1
Name:5-hydroxytryptamine receptor 3B
Synonyms:5HT3B_RAT Serotonin (5-HT) receptor
Type:PROTEIN
Mol. Mass.:50328.78
Organism:Rattus norvegicus
Description:EBI_11885
Residue:437
Component 2
Name:5-hydroxytryptamine receptor 3A
Synonyms:5-HT3 5HT3A_RAT Htr3 Serotonin (5-HT) receptor | Zacopride site-R
Type:Enzyme Catalytic Domain
Mol. Mass.:55428.70
Organism:RAT
Description:5-HT3 HTR3A RAT::P35563
Residue:483
BDBM50031932
NameBDBM50031932
Synonyms:7-(4-Methyl-piperazin-1-yl)-6H-5-oxa-8-aza-benzo[c]phenanthrene | CHEMBL304193
TypeSmall organic molecule
Emp. Form.C21H21N3O
Mol. Mass.331.4109
SMILESCN1CCN(CC1)c1nc2ccccc2c-2c1COc1ccccc-21