Reaction Details
TargetSodium-dependent dopamine transporter
LigandBDBM50004167
Substrate/Competitorn/a
Meas. Tech.ChEMBL_62476 (CHEMBL677368)
Ki 1.1±n/a nM
Citation Kozikowski, APEddine Saiah, MKJohnson, KMBergmann, JS Chemistry and biology of the 2 beta-alkyl-3 beta-phenyl analogues of cocaine: subnanomolar affinity ligands that suggest a new pharmacophore model at the C-2 position. J Med Chem38:3086-93 (1995) Sodium-dependent dopamine transporter
Name:Sodium-dependent dopamine transporter
Type:Multi-pass membrane protein
Mol. Mass.:68749.45
Organism:Rattus norvegicus (rat)
Description:P23977
Residue:619
BDBM50004167
NameBDBM50004167
Synonyms:(2R,3S)-3-(4-Chloro-phenyl)-2-((E)-2-chloro-vinyl)-8-methyl-8-aza-bicyclo[3.2.1]octane CHEMBL28394
TypeSmall organic molecule
Emp. Form.C16H19Cl2N
Mol. Mass.296.235
SMILESCN1C2CCC1[C@@H](\C=C\Cl)[C@H](C2)c1ccc(Cl)cc1