Reaction Details
TargetMuscarinic acetylcholine receptor M1
LigandBDBM50033149
Substrate/Competitorn/a
Meas. Tech.ChEMBL_138812 (CHEMBL747493)
IC50 74±n/a nM
Citation Ward, JSMerritt, LCalligaro, DOBymaster, FPShannon, HESawyer, BDMitch, CHDeeter, JBPeters, SCSheardown, MJ Functionally selective M1 muscarinic agonists. 3. Side chains and azacycles contributing to functional muscarinic selectivity among pyrazinylazacycles. J Med Chem38:3469-81 (1995) Muscarinic acetylcholine receptor M1
Name:Muscarinic acetylcholine receptor M1
Type:Enzyme Catalytic Domain
Mol. Mass.:51390.46
Organism:RAT
Description:P08482
Residue:460
BDBM50033149
NameBDBM50033149
Synonyms:3-Pyrazin-2-yl-1-aza-bicyclo[2.2.2]octane CHEMBL102560
TypeSmall organic molecule
Emp. Form.C11H15N3
Mol. Mass.189.2569
SMILESC1CN2CCC1C(C2)c1cnccn1