Reaction Details
TargetMuscarinic acetylcholine receptor M1
LigandBDBM50033153
Substrate/Competitorn/a
Meas. Tech.ChEMBL_138812 (CHEMBL747493)
IC50 7±n/a nM
Citation Ward, JSMerritt, LCalligaro, DOBymaster, FPShannon, HESawyer, BDMitch, CHDeeter, JBPeters, SCSheardown, MJ Functionally selective M1 muscarinic agonists. 3. Side chains and azacycles contributing to functional muscarinic selectivity among pyrazinylazacycles. J Med Chem38:3469-81 (1995) Muscarinic acetylcholine receptor M1
Name:Muscarinic acetylcholine receptor M1
Type:Enzyme Catalytic Domain
Mol. Mass.:51390.46
Organism:RAT
Description:P08482
Residue:460
BDBM50033153
NameBDBM50033153
Synonyms:(R)-3-(3-Hexyloxy-pyrazin-2-yl)-1-aza-bicyclo[2.2.1]heptane | CHEMBL325964
TypeSmall organic molecule
Emp. Form.C16H25N3O
Mol. Mass.275.3892
SMILESCCCCCCOc1nccnc1[C@H]1CN2CCC1C2