Reaction Details
TargetMuscarinic acetylcholine receptor M1
LigandBDBM50033145
Substrate/Competitorn/a
Meas. Tech.ChEMBL_138812 (CHEMBL747493)
IC50 44±n/a nM
Citation Ward, JSMerritt, LCalligaro, DOBymaster, FPShannon, HESawyer, BDMitch, CHDeeter, JBPeters, SCSheardown, MJ Functionally selective M1 muscarinic agonists. 3. Side chains and azacycles contributing to functional muscarinic selectivity among pyrazinylazacycles. J Med Chem38:3469-81 (1995) Muscarinic acetylcholine receptor M1
Name:Muscarinic acetylcholine receptor M1
Type:Enzyme Catalytic Domain
Mol. Mass.:51390.46
Organism:RAT
Description:P08482
Residue:460
BDBM50033145
NameBDBM50033145
Synonyms:6-(3-Hexyloxy-pyrazin-2-yl)-2,3,4,7-tetrahydro-1H-azepine | CHEMBL117193
TypeSmall organic molecule
Emp. Form.C16H25N3O
Mol. Mass.275.3892
SMILESCCCCCCOc1nccnc1C1=CCCCNC1