Reaction Details
TargetMuscarinic acetylcholine receptor M1
LigandBDBM50033157
Substrate/Competitorn/a
Meas. Tech.ChEMBL_138811 (CHEMBL747492)
IC50 23±n/a nM
Citation Ward, JSMerritt, LCalligaro, DOBymaster, FPShannon, HESawyer, BDMitch, CHDeeter, JBPeters, SCSheardown, MJ Functionally selective M1 muscarinic agonists. 3. Side chains and azacycles contributing to functional muscarinic selectivity among pyrazinylazacycles. J Med Chem38:3469-81 (1995) Muscarinic acetylcholine receptor M1
Name:Muscarinic acetylcholine receptor M1
Type:Enzyme Catalytic Domain
Mol. Mass.:51390.46
Organism:RAT
Description:P08482
Residue:460
BDBM50033157
NameBDBM50033157
Synonyms:3-(3-Methyl-pyrazin-2-yl)-1-aza-bicyclo[2.2.2]octane CHEMBL105136
TypeSmall organic molecule
Emp. Form.C12H17N3
Mol. Mass.203.2835
SMILESCc1nccnc1C1CN2CCC1CC2