Reaction Details
TargetMuscarinic acetylcholine receptor M1
LigandBDBM50033161
Substrate/Competitorn/a
Meas. Tech.ChEMBL_138812 (CHEMBL747493)
IC50 38±n/a nM
Citation Ward, JSMerritt, LCalligaro, DOBymaster, FPShannon, HESawyer, BDMitch, CHDeeter, JBPeters, SCSheardown, MJ Functionally selective M1 muscarinic agonists. 3. Side chains and azacycles contributing to functional muscarinic selectivity among pyrazinylazacycles. J Med Chem38:3469-81 (1995) Muscarinic acetylcholine receptor M1
Name:Muscarinic acetylcholine receptor M1
Type:Enzyme Catalytic Domain
Mol. Mass.:51390.46
Organism:RAT
Description:P08482
Residue:460
BDBM50033161
NameBDBM50033161
Synonyms:3-(3-Ethoxy-pyrazin-2-yl)-1-aza-bicyclo[2.2.2]octane | CHEMBL115803
TypeSmall organic molecule
Emp. Form.C13H19N3O
Mol. Mass.233.3095
SMILESCCOc1nccnc1C1CN2CCC1CC2