Reaction Details
TargetMuscarinic acetylcholine receptor M2
LigandBDBM50031098
Substrate/Competitorn/a
Meas. Tech.ChEMBL_140171 (CHEMBL745475)
Kd 30±n/a nM
Citation McPherson, DWLambert, CRJahn, KSood, VMcRee, RCZeeberg, BReba, RCKnapp, FF Resolution and in vitro and initial in vivo evaluation of isomers of iodine-125-labeled 1-azabicyclo[2.2.2]oct-3-yl alpha-hydroxy-alpha-(1-iodo-1-propen-3-yl)-alpha-phenylacetate: a high-affinity ligand for the muscarinic receptor. J Med Chem38:3908-17 (1995) Muscarinic acetylcholine receptor M2
Name:Muscarinic acetylcholine receptor M2
Type:Enzyme Catalytic Domain
Mol. Mass.:51555.53
Organism:RAT
Description:P10980
Residue:466
BDBM50031098
NameBDBM50031098
Synonyms:(E)-(R)-2-Hydroxy-5-iodo-2-phenyl-pent-4-enoic acid (R)-(1-aza-bicyclo[2.2.2]oct-3-yl) ester | CHEMBL127587
TypeSmall organic molecule
Emp. Form.C18H22INO3
Mol. Mass.427.2767
SMILESO[C@@](C\C=C\I)(C(=O)O[C@H]1CN2CCC1CC2)c1ccccc1