Reaction Details
Target5-hydroxytryptamine receptor 1A
LigandBDBM50029310
Substrate/Competitorn/a
Meas. Tech.ChEMBL_1435 (CHEMBL616308)
Ki 3.7±n/a nM
Citation Reitz, ABBaxter, EWBennett, DJCodd, EEJordan, ADMalloy, EAMaryanoff, BEMcDonnell, MEOrtegon, MERenzi, MJ N-aryl-N'-benzylpiperazines as potential antipsychotic agents. J Med Chem38:4211-22 (1995) 5-hydroxytryptamine receptor 1A
Name:5-hydroxytryptamine receptor 1A
Type:G Protein-Coupled Receptor (GPCR)
Mol. Mass.:46445.29
Organism:Rattus norvegicus (rat)
Description:Binding assays were performed using rat hippocampal membranes.
Residue:422
BDBM50029310
NameBDBM50029310
Synonyms:N-{3-[4-(2-Isopropoxy-phenyl)-piperazin-1-ylmethyl]-benzyl}-benzamide with succinic acid
TypeSmall organic molecule
Emp. Form.C28H33N3O2
Mol. Mass.443.5805
SMILESCC(C)Oc1ccccc1N1CCN(Cc2cccc(CNC(=O)c3ccccc3)c2)CC1