Reaction Details
Target5-hydroxytryptamine receptor 1A
LigandBDBM50029316
Substrate/Competitorn/a
Meas. Tech.ChEMBL_1435 (CHEMBL616308)
Ki 2.6±n/a nM
Citation Reitz, ABBaxter, EWBennett, DJCodd, EEJordan, ADMalloy, EAMaryanoff, BEMcDonnell, MEOrtegon, MERenzi, MJ N-aryl-N'-benzylpiperazines as potential antipsychotic agents. J Med Chem38:4211-22 (1995) 5-hydroxytryptamine receptor 1A
Name:5-hydroxytryptamine receptor 1A
Type:G Protein-Coupled Receptor (GPCR)
Mol. Mass.:46445.29
Organism:Rattus norvegicus (rat)
Description:Binding assays were performed using rat hippocampal membranes.
Residue:422
BDBM50029316
NameBDBM50029316
Synonyms:2-{3-[4-(2-Isopropoxy-phenyl)-piperazin-1-ylmethyl]-benzyl}-isoindole-1,3-dione with succinic acid
TypeSmall organic molecule
Emp. Form.C29H31N3O3
Mol. Mass.469.5747
SMILESCC(C)Oc1ccccc1N1CCN(Cc2cccc(CN3C(=O)c4ccccc4C3=O)c2)CC1