Reaction Details
Target5-hydroxytryptamine receptor 1A
LigandBDBM50001869
Substrate/Competitorn/a
Meas. Tech.ChEMBL_1435 (CHEMBL616308)
Ki 3.3±n/a nM
Citation Reitz, ABBaxter, EWBennett, DJCodd, EEJordan, ADMalloy, EAMaryanoff, BEMcDonnell, MEOrtegon, MERenzi, MJ N-aryl-N'-benzylpiperazines as potential antipsychotic agents. J Med Chem38:4211-22 (1995) 5-hydroxytryptamine receptor 1A
Name:5-hydroxytryptamine receptor 1A
Type:G Protein-Coupled Receptor (GPCR)
Mol. Mass.:46445.29
Organism:Rattus norvegicus (rat)
Description:Binding assays were performed using rat hippocampal membranes.
Residue:422
BDBM50001869
NameBDBM50001869
Synonyms:1-{5-[4-(2-Isopropoxy-phenyl)-piperazin-1-ylmethyl]-1-methyl-1H-pyrrol-2-ylmethyl}-piperidin-2-one RWJ-25730
TypeSmall organic molecule
Emp. Form.C25H36N4O2
Mol. Mass.424.5789
SMILESCC(C)Oc1ccccc1N1CCN(Cc2ccc(CN3CCCCC3=O)n2C)CC1