Reaction Details
TargetAcetylcholinesterase
LigandBDBM50029913
Substrate/Competitorn/a
Meas. Tech.ChEMBL_28910 (CHEMBL638608)
IC50 6.4±n/a nM
Citation Sugimoto, HIimura, YYamanishi, YYamatsu, K Synthesis and structure-activity relationships of acetylcholinesterase inhibitors: 1-benzyl-4-[(5,6-dimethoxy-1-oxoindan-2-yl)methyl]piperidine hydrochloride and related compounds. J Med Chem38:4821-9 (1996) Acetylcholinesterase
Name:Acetylcholinesterase
Type:Enzyme
Mol. Mass.:68165.65
Organism:Mus musculus (mouse)
Description:n/a
Residue:614
BDBM50029913
NameBDBM50029913
Synonyms:2-(1-Benzyl-piperidin-4-ylmethyl)-5-methoxy-indan-1-one; hydrochloride | CHEMBL544161
TypeSmall organic molecule
Emp. Form.C23H27NO2
Mol. Mass.349.466
SMILESCOc1ccc2C(=O)C(CC3CCN(Cc4ccccc4)CC3)Cc2c1